Reaction Details
TargetSodium/nucleoside cotransporter 1
LigandBDBM14487
Substrate/Competitorn/a
Meas. Tech.ChEMBL_1494515 (CHEMBL3528992)
IC50 5500±n/a nM
Citation Lepist, EIDamaraju, VLZhang, JGati, WPYao, SYSmith, KMKarpinski, EYoung, JDLeung, KHCass, CE Transport of A1 adenosine receptor agonist tecadenoson by human and mouse nucleoside transporters: evidence for blood-brain barrier transport by murine equilibrative nucleoside transporter 1 mENT1. Drug Metab Dispos41:916-22 (2013) 
 
Sodium/nucleoside cotransporter 1
Name:Sodium/nucleoside cotransporter 1
Type:PROTEIN
Mol. Mass.:71589.29
Organism:Homo sapiens (Human)
Description:ChEMBL_1494515
Residue:649
BDBM14487
NameBDBM14487
Synonyms:(2R,3R,4S,5R)-2-(6-amino-9H-purin-9-yl)-5-(hydroxymethyl)oxolane-3,4-diol Adenosine N6-Methylado cid_191 | cid_60961
TypeNucleoside or nucleotide
Emp. Form.C10H13N5O4
Mol. Mass.267.2413
SMILESNc1ncnc2n(cnc12)[C@@H]1O[C@H](CO)[C@@H](O)[C@H]1O