Reaction Details
TargetKynurenine 3-monooxygenase
LigandBDBM50088518
Substrate/Competitorn/a
Meas. Tech.ChEMBL_1487468 (CHEMBL3536663)
IC50 11000±n/a nM
Citation Beconi, MGYates, DLyons, KMatthews, KClifton, SMead, TPrime, MWinkler, DO'Connell, CWalter, DToledo-Sherman, LMunoz-Sanjuan, IDominguez, C Metabolism and pharmacokinetics of JM6 in mice: JM6 is not a prodrug for Ro-61-8048. Drug Metab Dispos40:2297-306 (2012) 
 
Kynurenine 3-monooxygenase
Name:Kynurenine 3-monooxygenase
Type:PROTEIN
Mol. Mass.:54371.88
Organism:Rattus norvegicus
Description:ChEMBL_1487468
Residue:478
BDBM50088518
NameBDBM50088518
Synonyms:CHEMBL3526576
TypeSmall organic molecule
Emp. Form.C18H17N3O7S2
Mol. Mass.451.473
SMILESCOc1ccc(cc1OC)S(=O)(=O)Nc1nc(c(CO)s1)-c1cccc(c1)[N+]([O-])=O