Reaction Details
TargetKynurenine 3-monooxygenase
LigandBDBM50061916
Substrate/Competitorn/a
Meas. Tech.ChEMBL_1487471 (CHEMBL3536666)
IC50 8000±n/a nM
Citation Beconi, MGYates, DLyons, KMatthews, KClifton, SMead, TPrime, MWinkler, DO'Connell, CWalter, DToledo-Sherman, LMunoz-Sanjuan, IDominguez, C Metabolism and pharmacokinetics of JM6 in mice: JM6 is not a prodrug for Ro-61-8048. Drug Metab Dispos40:2297-306 (2012) 
 
Kynurenine 3-monooxygenase
Name:Kynurenine 3-monooxygenase
Type:PROTEIN
Mol. Mass.:54371.88
Organism:Rattus norvegicus
Description:ChEMBL_1487468
Residue:478
BDBM50061916
NameBDBM50061916
Synonyms:3,4-Dimethoxy-N-[4-(3-nitro-phenyl)-thiazol-2-yl]-benzenesulfonamide | CHEMBL134915
TypeSmall organic molecule
Emp. Form.C17H15N3O6S2
Mol. Mass.421.448
SMILESCOc1ccc(cc1OC)S(=O)(=O)Nc1nc(cs1)-c1cccc(c1)[N+]([O-])=O