Reaction Details
TargetD(2) dopamine receptor
LigandBDBM50436541
Substrate/Competitorn/a
Meas. Tech.ChEMBL_1496588 (CHEMBL3578854)
Ki 9.4±n/a nM
Citation Weichert, DBanerjee, AHiller, CKling, RCHübner, HGmeiner, P Molecular determinants of biased agonism at the dopamine D2 receptor. J Med Chem58:2703-17 (2015) 
 
D(2) dopamine receptor
Name:D(2) dopamine receptor
Type:Cell-surface receptors
Mol. Mass.:50647.10
Organism:Homo sapiens (Human)
Description:P14416
Residue:443
BDBM50436541
NameBDBM50436541
Synonyms:CHEMBL2396663
TypeSmall organic molecule
Emp. Form.C28H34N2O
Mol. Mass.414.5824
SMILESCCCN(CCCCNC(=O)c1ccc(cc1)-c1ccccc1)[C@H]1CCC(=CC1)C#C