Reaction Details
TargetD(2) dopamine receptor
LigandBDBM50088582
Substrate/Competitorn/a
Meas. Tech.ChEMBL_1496588 (CHEMBL3578854)
Ki 0.470000±n/a nM
Citation Weichert, DBanerjee, AHiller, CKling, RCHübner, HGmeiner, P Molecular determinants of biased agonism at the dopamine D2 receptor. J Med Chem58:2703-17 (2015) 
 
D(2) dopamine receptor
Name:D(2) dopamine receptor
Type:Cell-surface receptors
Mol. Mass.:50647.10
Organism:Homo sapiens (Human)
Description:P14416
Residue:443
BDBM50088582
NameBDBM50088582
Synonyms:CHEMBL3577346
TypeSmall organic molecule
Emp. Form.C34H49N5O4
Mol. Mass.591.784
SMILESCCCCn1cc(CCCOc2ccc(cc2OC)C(=O)NCCCCN(CCC)[C@H]2CCc3c(O)cccc3C2)nn1