Reaction Details
TargetHexokinase-4
LigandBDBM50089173
Substrate/Competitorn/a
Meas. Tech.ChEMBL_1495696 (CHEMBL3578684)
EC50 12±n/a nM
Citation Park, KLee, BMHyun, KHHan, TLee, DHChoi, HH Design and Synthesis of Acetylenyl Benzamide Derivatives as Novel Glucokinase Activators for the Treatment of T2DM. ACS Med Chem Lett6:296-301 (2015) 
 
Hexokinase-4
Name:Hexokinase-4
Type:Enzyme
Mol. Mass.:52175.81
Organism:Homo sapiens (Human)
Description:P35557
Residue:465
BDBM50089173
NameBDBM50089173
Synonyms:CHEMBL3577720
TypeSmall organic molecule
Emp. Form.C25H24N4O3
Mol. Mass.428.4831
SMILESCOC[C@H](C)Oc1cc(cc(c1)C(=O)Nc1ccn(C)n1)C#Cc1ccc2[nH]ccc2c1