Reaction Details
TargetMelanocortin receptor 4
LigandBDBM50089422
Substrate/Competitorn/a
Meas. Tech.ChEMBL_1496671 (CHEMBL3579242)
Ki 63±n/a nM
Citation Ericson, MDWilczynski, ASorensen, NBXiang, ZHaskell-Luevano, C Discovery of aß-Hairpin Octapeptide, c[Pro-Arg-Phe-Phe-Dap-Ala-Phe-DPro], Mimetic of Agouti-Related Protein(87-132) [AGRP(87-132)] with Equipotent Mouse Melanocortin-4 Receptor (mMC4R) Antagonist Pharmacology. J Med Chem58:4638-47 (2015) 
 
Melanocortin receptor 4
Name:Melanocortin receptor 4
Type:PROTEIN
Mol. Mass.:36964.43
Organism:Mus musculus
Description:ChEMBL_1498850
Residue:332
BDBM50089422
NameBDBM50089422
Synonyms:CHEMBL3577978
TypeSmall organic molecule
Emp. Form.C82H108N22O19S4
Mol. Mass.1834.131
SMILES[H][C@]12CSSC[C@@]([H])(NC(=O)[C@H](Cc3ccccc3)NC(=O)[C@H](C)NC(=O)[C@H](CC(N)=O)NC(=O)[C@H](Cc3ccccc3)NC(=O)[C@H](Cc3ccccc3)NC(=O)[C@H](CCCNC(N)=N)NC1=O)C(=O)N[C@@H](Cc1ccc(O)cc1)C(=O)N[C@@H](CSSC[C@H](NC(=O)[C@@H](NC(C)=O)[C@@H](C)O)C(=O)N[C@@H](Cc1ccc(O)cc1)C(=O)N2)C(=O)N[C@@H](CCCNC(N)=N)C(N)=O