Reaction Details
TargetMelanocyte-stimulating hormone receptor
LigandBDBM50089409
Substrate/Competitorn/a
Meas. Tech.ChEMBL_1496668 (CHEMBL3579239)
EC50 20300±n/a nM
Citation Ericson, MDWilczynski, ASorensen, NBXiang, ZHaskell-Luevano, C Discovery of aß-Hairpin Octapeptide, c[Pro-Arg-Phe-Phe-Dap-Ala-Phe-DPro], Mimetic of Agouti-Related Protein(87-132) [AGRP(87-132)] with Equipotent Mouse Melanocortin-4 Receptor (mMC4R) Antagonist Pharmacology. J Med Chem58:4638-47 (2015) 
 
Melanocyte-stimulating hormone receptor
Name:Melanocyte-stimulating hormone receptor
Type:PROTEIN
Mol. Mass.:35238.60
Organism:Mus musculus
Description:ChEMBL_1498846
Residue:315
BDBM50089409
NameBDBM50089409
Synonyms:CHEMBL3577991
TypeSmall organic molecule
Emp. Form.C51H66N12O9
Mol. Mass.991.1447
SMILES[H][C@@]12CCCN1C(=O)[C@@]1([H])CCCN1C(=O)[C@H](Cc1ccccc1)NC(=O)[C@H](C)NC(=O)[C@H](CC(N)=O)NC(=O)C(CCc1ccccc1)NC(=O)[C@H](Cc1ccccc1)NC(=O)[C@H](CCCNC(N)=N)NC2=O