Reaction Details
TargetCarboxypeptidase N catalytic chain
LigandBDBM50089686
Substrate/Competitorn/a
Meas. Tech.ChEMBL_1496379 (CHEMBL3580145)
IC50 5700±n/a nM
Citation Halland, NBrönstrup, MCzech, JCzechtizky, WEvers, AFollmann, MKohlmann, MSchiell, MKurz, MSchreuder, HAKallus, C Novel Small Molecule Inhibitors of Activated Thrombin Activatable Fibrinolysis Inhibitor (TAFIa) from Natural Product Anabaenopeptin. J Med Chem58:4839-44 (2015) 
 
Carboxypeptidase N catalytic chain
Name:Carboxypeptidase N catalytic chain
Type:PROTEIN
Mol. Mass.:52293.66
Organism:Homo sapiens (Human)
Description:ChEMBL_1496379
Residue:458
BDBM50089686
NameBDBM50089686
Synonyms:CHEMBL3577334
TypeSmall organic molecule
Emp. Form.C41H60N8O9
Mol. Mass.808.9633
SMILESCC(C)[C@@H]1NC(=O)[C@@H](CCCCNC(=O)[C@H](Cc2ccccc2)NC(=O)[C@H](C)N(C)C(=O)[C@H](CCc2ccc(O)cc2)NC1=O)NC(=O)N[C@@H](CCCCN)C(O)=O