Reaction Details
TargetCarboxypeptidase B2
LigandBDBM50089687
Substrate/Competitorn/a
Meas. Tech.ChEMBL_1496377 (CHEMBL3580143)
IC50 1.5±n/a nM
Citation Halland, NBrönstrup, MCzech, JCzechtizky, WEvers, AFollmann, MKohlmann, MSchiell, MKurz, MSchreuder, HAKallus, C Novel Small Molecule Inhibitors of Activated Thrombin Activatable Fibrinolysis Inhibitor (TAFIa) from Natural Product Anabaenopeptin. J Med Chem58:4839-44 (2015) 
 
Carboxypeptidase B2
Name:Carboxypeptidase B2
Type:Enzyme
Mol. Mass.:48432.74
Organism:Homo sapiens (Human)
Description:Q96IY4
Residue:423
BDBM50089687
NameBDBM50089687
Synonyms:Anabaenopeptin F
TypeSmall organic molecule
Emp. Form.C42H62N10O9
Mol. Mass.851.0033
SMILES[H][C@]1(NC(=O)[C@@H](CCCCNC(=O)[C@H](Cc2ccccc2)NC(=O)[C@H](C)N(C)C(=O)[C@H](CCc2ccc(O)cc2)NC1=O)NC(=O)N[C@@H](CCCNC(N)=N)C(O)=O)[C@@H](C)CC