Reaction Details
TargetCarboxypeptidase B2
LigandBDBM50089755
Substrate/Competitorn/a
Meas. Tech.ChEMBL_1496377 (CHEMBL3580143)
IC50 4.0±n/a nM
Citation Halland, NBrönstrup, MCzech, JCzechtizky, WEvers, AFollmann, MKohlmann, MSchiell, MKurz, MSchreuder, HAKallus, C Novel Small Molecule Inhibitors of Activated Thrombin Activatable Fibrinolysis Inhibitor (TAFIa) from Natural Product Anabaenopeptin. J Med Chem58:4839-44 (2015) 
 
Carboxypeptidase B2
Name:Carboxypeptidase B2
Type:Enzyme
Mol. Mass.:48432.74
Organism:Homo sapiens (Human)
Description:Q96IY4
Residue:423
BDBM50089755
NameBDBM50089755
Synonyms:CHEMBL3577439
TypeSmall organic molecule
Emp. Form.C25H44N4O4S
Mol. Mass.496.706
SMILESCC12CCC(C(C1)NC(=O)[C@@H](CC1CCCCC1)NC(=O)N[C@@H](CSCCN)C(O)=O)C2(C)C