Reaction Details
TargetNociceptin receptor
LigandBDBM50090766
Substrate/Competitorn/a
Meas. Tech.ChEMBL_1498305 (CHEMBL3583928)
EC50 230±n/a nM
Citation Cueva, JPRoche, COstovar, MKumar, VClark, MJHillhouse, TMLewis, JWTraynor, JRHusbands, SM C7ß-methyl analogues of the orvinols: the discovery of kappa opioid antagonists with nociceptin/orphanin FQ peptide (NOP) receptor partial agonism and low, or zero, efficacy at mu opioid receptors. J Med Chem58:4242-9 (2015) 
 
Nociceptin receptor
Name:Nociceptin receptor
Type:G Protein-Coupled Receptor (GPCR)
Mol. Mass.:40702.87
Organism:Homo sapiens (Human)
Description:P41146
Residue:370
BDBM50090766
NameBDBM50090766
Synonyms:CHEMBL3581756
TypeSmall organic molecule
Emp. Form.C31H36ClNO4
Mol. Mass.522.075
SMILES[H][C@@]12Oc3c4c(C[C@@]5([H])N(CC6CC6)CC[C@@]14[C@@]51CC[C@@]2(OC)[C@](C)(C1)[C@H](O)c1cccc(Cl)c1)ccc3O