Reaction Details
TargetMu-type opioid receptor
LigandBDBM50090731
Substrate/Competitorn/a
Meas. Tech.ChEMBL_1498300 (CHEMBL3583923)
EC50 1.4±n/a nM
Citation Cueva, JPRoche, COstovar, MKumar, VClark, MJHillhouse, TMLewis, JWTraynor, JRHusbands, SM C7ß-methyl analogues of the orvinols: the discovery of kappa opioid antagonists with nociceptin/orphanin FQ peptide (NOP) receptor partial agonism and low, or zero, efficacy at mu opioid receptors. J Med Chem58:4242-9 (2015) 
 
Mu-type opioid receptor
Name:Mu-type opioid receptor
Type:G Protein-Coupled Receptor (GPCR)
Mol. Mass.:44503.11
Organism:Rattus norvegicus (rat)
Description:Competition binding assays were carried out using membrane preparations from transfected HN9.10 cells that constitutively expressed the mu opioid receptor.
Residue:398
BDBM50090731
NameBDBM50090731
Synonyms:CHEMBL3581741 US9480684, 22, R = 3- MePh- BU10112
TypeSmall organic molecule
Emp. Form.C32H37NO4
Mol. Mass.499.6405
SMILES[H][C@@]12Oc3c4c(C[C@@]5([H])N(CC6CC6)CC[C@@]14[C@]51C[C@](C)([C@H](O)c4cccc(C)c4)[C@]2(OC)C=C1)ccc3O