Reaction Details
TargetAngiotensin-converting enzyme
LigandBDBM21642
Substrate/Competitorn/a
Meas. Tech.ChEMBL_1499342 (CHEMBL3583583)
IC50 1.6±n/a nM
Citation Nakabayashi, RYang, ZNishizawa, TMori, TSaito, K Top-down Targeted Metabolomics Reveals a Sulfur-Containing Metabolite with Inhibitory Activity against Angiotensin-Converting Enzyme in Asparagus officinalis. J Nat Prod78:1179-83 (2015) 
 
Angiotensin-converting enzyme
Name:Angiotensin-converting enzyme
Type:Enzyme
Mol. Mass.:149709.01
Organism:Homo sapiens (Human)
Description:n/a
Residue:1306
BDBM21642
NameBDBM21642
Synonyms:(2S)-1-[(2S)-2-methyl-3-sulfanylpropanoyl]pyrrolidine-2-carboxylic acid Capozide Lopirin SQ14534 | US11491146, Compound L-Captopril
TypeSmall organic molecule
Emp. Form.C9H15NO3S
Mol. Mass.217.285
SMILESC[C@H](CS)C(=O)N1CCC[C@H]1C(O)=O