Reaction Details
TargetCannabinoid receptor 2
LigandBDBM50090956
Substrate/Competitorn/a
Meas. Tech.ChEMBL_1499669 (CHEMBL3584846)
Ki 12±n/a nM
Citation Slavik, RGrether, UMüller Herde, AGobbi, LFingerle, JUllmer, CKrämer, SDSchibli, RMu, LAmetamey, SM Discovery of a high affinity and selective pyridine analog as a potential positron emission tomography imaging agent for cannabinoid type 2 receptor. J Med Chem58:4266-77 (2015) 
 
Cannabinoid receptor 2
Name:Cannabinoid receptor 2
Type:Enzyme Catalytic Domain
Mol. Mass.:38220.43
Organism:MOUSE
Description:P47936
Residue:347
BDBM50090956
NameBDBM50090956
Synonyms:CHEMBL3582027
TypeSmall organic molecule
Emp. Form.C26H37N3O5
Mol. Mass.471.5891
SMILESCCOCCOCC(C)(C)c1cc(NC(=O)c2ccc(C3CCCC3)c(OCC3CC3)n2)on1