Reaction Details
TargetCannabinoid receptor 2
LigandBDBM50090949
Substrate/Competitorn/a
Meas. Tech.ChEMBL_1499669 (CHEMBL3584846)
Ki 60±n/a nM
Citation Slavik, RGrether, UMüller Herde, AGobbi, LFingerle, JUllmer, CKrämer, SDSchibli, RMu, LAmetamey, SM Discovery of a high affinity and selective pyridine analog as a potential positron emission tomography imaging agent for cannabinoid type 2 receptor. J Med Chem58:4266-77 (2015) 
 
Cannabinoid receptor 2
Name:Cannabinoid receptor 2
Type:Enzyme Catalytic Domain
Mol. Mass.:38220.43
Organism:MOUSE
Description:P47936
Residue:347
BDBM50090949
NameBDBM50090949
Synonyms:CHEMBL3582009
TypeSmall organic molecule
Emp. Form.C21H32N4O4
Mol. Mass.404.5032
SMILESCCC(CC)(NC(=O)c1ccc(N2CC(C2)OC)c(OCC2CC2)n1)C(=O)NC