Reaction Details
TargetATP-dependent translocase ABCB1
LigandBDBM50091089
Substrate/Competitorn/a
Meas. Tech.ChEMBL_1500054 (CHEMBL3584050)
IC50 14±n/a nM
Citation Wong, ILWang, BCYuan, JDuan, LXLiu, ZLiu, TLi, XMHu, XZhang, XYJiang, TWan, SBChow, LM Potent and Nontoxic Chemosensitizer of P-Glycoprotein-Mediated Multidrug Resistance in Cancer: Synthesis and Evaluation of Methylated Epigallocatechin, Gallocatechin, and Dihydromyricetin Derivatives. J Med Chem58:4529-49 (2015) 
 
ATP-dependent translocase ABCB1
Name:ATP-dependent translocase ABCB1
Type:Protein
Mol. Mass.:141503.50
Organism:Homo sapiens (Human)
Description:P08183
Residue:1280
BDBM50091089
NameBDBM50091089
Synonyms:CHEMBL3582158
TypeSmall organic molecule
Emp. Form.C43H40F2N2O12
Mol. Mass.814.7807
SMILESCOc1cc(OC)c2C[C@@H](OC(=O)c3ccc(F)c(NC(=O)c4ccc(F)c(NC(=O)c5ccc(OC)c(OC)c5)c4)c3)[C@H](Oc2c1)c1cc(OC)c(OC)c(OC)c1