Reaction Details
TargetATP-dependent translocase ABCB1
LigandBDBM50091090
Substrate/Competitorn/a
Meas. Tech.ChEMBL_1500054 (CHEMBL3584050)
IC50 13±n/a nM
Citation Wong, ILWang, BCYuan, JDuan, LXLiu, ZLiu, TLi, XMHu, XZhang, XYJiang, TWan, SBChow, LM Potent and Nontoxic Chemosensitizer of P-Glycoprotein-Mediated Multidrug Resistance in Cancer: Synthesis and Evaluation of Methylated Epigallocatechin, Gallocatechin, and Dihydromyricetin Derivatives. J Med Chem58:4529-49 (2015) 
 
ATP-dependent translocase ABCB1
Name:ATP-dependent translocase ABCB1
Type:Protein
Mol. Mass.:141503.50
Organism:Homo sapiens (Human)
Description:P08183
Residue:1280
BDBM50091090
NameBDBM50091090
Synonyms:CHEMBL3582159
TypeSmall organic molecule
Emp. Form.C44H42F2N2O13
Mol. Mass.844.8067
SMILESCOc1cc(OC)c2C[C@@H](OC(=O)c3ccc(F)c(NC(=O)c4ccc(F)c(NC(=O)c5cc(OC)c(OC)c(OC)c5)c4)c3)[C@H](Oc2c1)c1cc(OC)c(OC)c(OC)c1