Reaction Details
TargetAlpha-1A adrenergic receptor
LigandBDBM50091352
Substrate/Competitorn/a
Meas. Tech.ChEMBL_1497770 (CHEMBL3583290)
IC50 3.9±n/a nM
Citation Zhang, WMa, ZLi, WLi, GChen, LLiu, ZDu, LLi, M Discovery of Quinazoline-Based Fluorescent Probes toa1-Adrenergic Receptors. ACS Med Chem Lett6:502-6 (2015) 
 
Alpha-1A adrenergic receptor
Name:Alpha-1A adrenergic receptor
Type:Cell-surface receptors
Mol. Mass.:51511.67
Organism:Homo sapiens (Human)
Description:P35348
Residue:466
BDBM50091352
NameBDBM50091352
Synonyms:CHEMBL3582268
TypeSmall organic molecule
Emp. Form.C24H23N5O6
Mol. Mass.477.4693
SMILESCOc1cc2nc(nc(N)c2cc1OC)N1CCN(CC1)C(=O)c1cc2ccc(O)cc2oc1=O