Reaction Details
TargetHepatocyte growth factor receptor
LigandBDBM60589
Substrate/Competitorn/a
Meas. Tech.ChEMBL_1497944 (CHEMBL3583343)
IC50 4.0±n/a nM
Citation Li, CAi, JZhang, DPeng, XChen, XGao, ZSu, YZhu, WJi, YChen, XGeng, MLiu, H Design, Synthesis, and Biological Evaluation of Novel Imidazo[1,2-a]pyridine Derivatives as Potent c-Met Inhibitors. ACS Med Chem Lett6:507-12 (2015) 
 
Hepatocyte growth factor receptor
Name:Hepatocyte growth factor receptor
Type:Protein
Mol. Mass.:155559.73
Organism:Homo sapiens (Human)
Description:P08581
Residue:1390
BDBM60589
NameBDBM60589
Synonyms:6-{[6-(1-methyl-1H-pyrazol-4-yl)-[1,2,4]triazolo[4,3-b]pyridazin-3-yl]sulfanyl}quinoline (4) | BDBM50355498
Typen/a
Emp. Form.C18H13N7S
Mol. Mass.359.408
SMILESCn1cc(cn1)-c1ccc2nnc(Sc3ccc4ncccc4c3)n2n1