Reaction Details
TargetBeta-secretase 1
LigandBDBM50094977
Substrate/Competitorn/a
Meas. Tech.ChEMBL_1503095 (CHEMBL3592345)
Ki 1.9±n/a nM
Citation Vila-Real, HCoelho, HRocha, JFernandes, AVentura, MRMaycock, CDIranzo, OSimplício, AL Peptidomimeticß-Secretase Inhibitors Comprising a Sequence of Amyloid-ß Peptide for Alzheimer's Disease. J Med Chem58:5408-18 (2015) 
 
Beta-secretase 1
Name:Beta-secretase 1
Type:Protein
Mol. Mass.:55755.10
Organism:Homo sapiens (Human)
Description:P56817
Residue:501
BDBM50094977
NameBDBM50094977
Synonyms:CHEMBL3589000
TypeSmall organic molecule
Emp. Form.C60H89N11O20
Mol. Mass.1284.4104
SMILESCC(C)C[C@H](NC(=O)[C@H](CC(O)=O)NC(=O)[C@H](CC(C)C)NC(=O)[C@@H](N)CCC(O)=O)[C@@H](O)C[C@@H](C)C(=O)N[C@@H](C(C)C)C(=O)N[C@@H](Cc1ccccc1)C(=O)N[C@@H](Cc1ccc(O)cc1)C(=O)N[C@@H](C)C(=O)N[C@@H](CCC(O)=O)C(=O)N[C@@H](CC(O)=O)C(N)=O