Reaction Details
TargetVesicular acetylcholine transporter
LigandBDBM50039623
Substrate/Competitorn/a
Meas. Tech.ChEMBL_1503354 (CHEMBL3590745)
Ki 25±n/a nM
Citation Barthel, CSorger, DDeuther-Conrad, WScheunemann, MSchweiger, SJäckel, PRoghani, ASteinbach, JSchüürmann, GSabri, OBrust, PWenzel, B New systematically modified vesamicol analogs and their affinity and selectivity for the vesicular acetylcholine transporter - A critical examination of the lead structure. Eur J Med Chem100:50-67 (2015) 
 
Vesicular acetylcholine transporter
Name:Vesicular acetylcholine transporter
Type:PROTEIN
Mol. Mass.:56533.41
Organism:Rattus norvegicus
Description:ChEMBL_1503353
Residue:530
BDBM50039623
NameBDBM50039623
Synonyms:(2R,3R)-5-Amino-3-(4-phenyl-piperidin-1-yl)-1,2,3,4-tetrahydro-naphthalen-2-ol | CHEMBL87381
TypeSmall organic molecule
Emp. Form.C21H26N2O
Mol. Mass.322.4439
SMILESNc1cccc2C[C@@H](O)[C@@H](Cc12)N1CCC(CC1)c1ccccc1