Reaction Details
TargetDihydroorotate dehydrogenase (quinone), mitochondrial
LigandBDBM50018011
Substrate/Competitorn/a
Meas. Tech.ChEMBL_1503366 (CHEMBL3590869)
IC50 1000±n/a nM
Citation Lucas-Hourani, MMunier-Lehmann, HEl Mazouni, FMalmquist, NAHarpon, JCoutant, EPGuillou, SHelynck, ONoel, AScherf, APhillips, MATangy, FVidalain, POJanin, YL Original 2-(3-Alkoxy-1H-pyrazol-1-yl)azines Inhibitors of Human Dihydroorotate Dehydrogenase (DHODH). J Med Chem58:5579-98 (2015) 
 
Dihydroorotate dehydrogenase (quinone), mitochondrial
Name:Dihydroorotate dehydrogenase (quinone), mitochondrial
Type:Enzyme
Mol. Mass.:42881.33
Organism:Homo sapiens (Human)
Description:Q02127
Residue:395
BDBM50018011
NameBDBM50018011
Synonyms:Aubagio HMR-1726 | TERIFLUNOMIDE
TypeSmall organic molecule
Emp. Form.C12H9F3N2O2
Mol. Mass.270.2073
SMILESC\C(O)=C(/C#N)C(=O)Nc1ccc(cc1)C(F)(F)F