Reaction Details
TargetSodium channel protein type 10 subunit alpha
LigandBDBM50095311
Substrate/Competitorn/a
Meas. Tech.ChEMBL_1503969 (CHEMBL3590899)
IC50 190±n/a nM
Citation Bagal, SKBungay, PJDenton, SMGibson, KRGlossop, MSHay, TLKemp, MILane, CALewis, MLMaw, GNMillion, WAPayne, CEPoinsard, CRawson, DJStammen, BLStevens, EBThompson, LR Discovery and Optimization of Selective Nav1.8 Modulator Series That Demonstrate Efficacy in Preclinical Models of Pain. ACS Med Chem Lett6:650-4 (2015) 
 
Sodium channel protein type 10 subunit alpha
Name:Sodium channel protein type 10 subunit alpha
Type:Enzyme
Mol. Mass.:220609.21
Organism:Homo sapiens (Human)
Description:Q9Y5Y9
Residue:1956
BDBM50095311
NameBDBM50095311
Synonyms:CHEMBL3589904
TypeSmall organic molecule
Emp. Form.C17H16ClN5O2
Mol. Mass.357.794
SMILESCOc1ccc(Cl)c(c1)-c1ccc(NC(=O)c2ccnn2C)nc1N