Reaction Details
TargetSodium channel protein type 10 subunit alpha
LigandBDBM50095331
Substrate/Competitorn/a
Meas. Tech.ChEMBL_1503943 (CHEMBL3590772)
IC50 500±n/a nM
Citation Bagal, SKBungay, PJDenton, SMGibson, KRGlossop, MSHay, TLKemp, MILane, CALewis, MLMaw, GNMillion, WAPayne, CEPoinsard, CRawson, DJStammen, BLStevens, EBThompson, LR Discovery and Optimization of Selective Nav1.8 Modulator Series That Demonstrate Efficacy in Preclinical Models of Pain. ACS Med Chem Lett6:650-4 (2015) 
 
Sodium channel protein type 10 subunit alpha
Name:Sodium channel protein type 10 subunit alpha
Type:Enzyme
Mol. Mass.:220609.21
Organism:Homo sapiens (Human)
Description:Q9Y5Y9
Residue:1956
BDBM50095331
NameBDBM50095331
Synonyms:CHEMBL3589903
TypeSmall organic molecule
Emp. Form.C17H15ClN4O3
Mol. Mass.358.779
SMILESCOc1ccc(Cl)c(c1)-c1ccc(NC(=O)c2conc2C)nc1N