Reaction Details
TargetProtein arginine N-methyltransferase 8
LigandBDBM50095435
Substrate/Competitorn/a
Meas. Tech.ChEMBL_1504109 (CHEMBL3591483)
IC50 65±n/a nM
Citation Mitchell, LHDrew, AERibich, SARioux, NSwinger, KKJacques, SLLingaraj, TBoriack-Sjodin, PAWaters, NJWigle, TJMoradei, OJin, LRiera, TPorter-Scott, MMoyer, MPSmith, JJChesworth, RCopeland, RA Aryl Pyrazoles as Potent Inhibitors of Arginine Methyltransferases: Identification of the First PRMT6 Tool Compound. ACS Med Chem Lett6:655-9 (2015) 
 
Protein arginine N-methyltransferase 8
Name:Protein arginine N-methyltransferase 8
Type:Protein
Mol. Mass.:45293.70
Organism:Homo sapiens (Human)
Description:n/a
Residue:394
BDBM50095435
NameBDBM50095435
Synonyms:CHEMBL3590417
TypeSmall organic molecule
Emp. Form.C22H27N5O2
Mol. Mass.393.4821
SMILESCNCCN(C)Cc1n[nH]cc1-c1ccc(Oc2ccccc2C(=O)NC)cc1