Reaction Details
TargetProtein arginine N-methyltransferase 6
LigandBDBM50095441
Substrate/Competitorn/a
Meas. Tech.ChEMBL_1504108 (CHEMBL3591482)
IC50 10.0±n/a nM
Citation Mitchell, LHDrew, AERibich, SARioux, NSwinger, KKJacques, SLLingaraj, TBoriack-Sjodin, PAWaters, NJWigle, TJMoradei, OJin, LRiera, TPorter-Scott, MMoyer, MPSmith, JJChesworth, RCopeland, RA Aryl Pyrazoles as Potent Inhibitors of Arginine Methyltransferases: Identification of the First PRMT6 Tool Compound. ACS Med Chem Lett6:655-9 (2015) 
 
Protein arginine N-methyltransferase 6
Name:Protein arginine N-methyltransferase 6
Type:Protein
Mol. Mass.:41928.48
Organism:Homo sapiens (Human)
Description:n/a
Residue:375
BDBM50095441
NameBDBM50095441
Synonyms:CHEMBL3589039
TypeSmall organic molecule
Emp. Form.C25H38N4O3
Mol. Mass.442.5942
SMILESCNCCN(C)Cc1c[nH]nc1-c1ccc(O[C@H]2C[C@@H](C2)OCCC2CCOCC2)cc1