Reaction Details
TargetProtein arginine N-methyltransferase 6
LigandBDBM50095350
Substrate/Competitorn/a
Meas. Tech.ChEMBL_1504108 (CHEMBL3591482)
IC50 32±n/a nM
Citation Mitchell, LHDrew, AERibich, SARioux, NSwinger, KKJacques, SLLingaraj, TBoriack-Sjodin, PAWaters, NJWigle, TJMoradei, OJin, LRiera, TPorter-Scott, MMoyer, MPSmith, JJChesworth, RCopeland, RA Aryl Pyrazoles as Potent Inhibitors of Arginine Methyltransferases: Identification of the First PRMT6 Tool Compound. ACS Med Chem Lett6:655-9 (2015) 
 
Protein arginine N-methyltransferase 6
Name:Protein arginine N-methyltransferase 6
Type:Protein
Mol. Mass.:41928.48
Organism:Homo sapiens (Human)
Description:n/a
Residue:375
BDBM50095350
NameBDBM50095350
Synonyms:CHEMBL3589034
TypeSmall organic molecule
Emp. Form.C19H30N4O2
Mol. Mass.346.4671
SMILESCNCCN(C)Cc1cn[nH]c1-c1ccc(OC(CO)C(C)C)cc1