Reaction Details
TargetProtein arginine N-methyltransferase 6
LigandBDBM50095354
Substrate/Competitorn/a
Meas. Tech.ChEMBL_1504108 (CHEMBL3591482)
IC50 8.0±n/a nM
Citation Mitchell, LHDrew, AERibich, SARioux, NSwinger, KKJacques, SLLingaraj, TBoriack-Sjodin, PAWaters, NJWigle, TJMoradei, OJin, LRiera, TPorter-Scott, MMoyer, MPSmith, JJChesworth, RCopeland, RA Aryl Pyrazoles as Potent Inhibitors of Arginine Methyltransferases: Identification of the First PRMT6 Tool Compound. ACS Med Chem Lett6:655-9 (2015) 
 
Protein arginine N-methyltransferase 6
Name:Protein arginine N-methyltransferase 6
Type:Protein
Mol. Mass.:41928.48
Organism:Homo sapiens (Human)
Description:n/a
Residue:375
BDBM50095354
NameBDBM50095354
Synonyms:CHEMBL3589030
TypeSmall organic molecule
Emp. Form.C16H23ClN4O
Mol. Mass.322.833
SMILESCC(C)Oc1ccc(cc1Cl)-c1[nH]ncc1CN(C)CCN