Reaction Details
TargetPotassium voltage-gated channel subfamily H member 2
LigandBDBM50095764
Substrate/Competitorn/a
Meas. Tech.ChEMBL_1504608 (CHEMBL3591513)
Ki 1.8±n/a nM
Citation Yu, Zvan Veldhoven, JPLouvel, J't Hart, IMRook, MBvan der Heyden, MAHeitman, LHIJzerman, AP Structure-Affinity Relationships (SARs) and Structure-Kinetics Relationships (SKRs) of Kv11.1 Blockers. J Med Chem58:5916-29 (2015) 
 
Potassium voltage-gated channel subfamily H member 2
Name:Potassium voltage-gated channel subfamily H member 2
Type:Multi-pass membrane protein
Mol. Mass.:126672.65
Organism:Homo sapiens (Human)
Description:Q12809
Residue:1159
BDBM50095764
NameBDBM50095764
Synonyms:CHEMBL3140084
TypeSmall organic molecule
Emp. Form.C20H31ClN
Mol. Mass.320.919
SMILESCCCCCCC[N+](CC)(CC)CC#Cc1ccc(Cl)cc1