Reaction Details
TargetPotassium voltage-gated channel subfamily H member 2
LigandBDBM50095780
Substrate/Competitorn/a
Meas. Tech.ChEMBL_1504608 (CHEMBL3591513)
Ki 17±n/a nM
Citation Yu, Zvan Veldhoven, JPLouvel, J't Hart, IMRook, MBvan der Heyden, MAHeitman, LHIJzerman, AP Structure-Affinity Relationships (SARs) and Structure-Kinetics Relationships (SKRs) of Kv11.1 Blockers. J Med Chem58:5916-29 (2015) 
 
Potassium voltage-gated channel subfamily H member 2
Name:Potassium voltage-gated channel subfamily H member 2
Type:Multi-pass membrane protein
Mol. Mass.:126672.65
Organism:Homo sapiens (Human)
Description:Q12809
Residue:1159
BDBM50095780
NameBDBM50095780
Synonyms:CHEMBL3590466
TypeSmall organic molecule
Emp. Form.C27H48F3NO3S
Mol. Mass.523.735
SMILES[O-]S(=O)(=O)C(F)(F)F.CCCCCCCCCCc1cccc(CCCCCCCCCC)[n+]1C