Reaction Details
TargetPotassium voltage-gated channel subfamily H member 2
LigandBDBM50095789
Substrate/Competitorn/a
Meas. Tech.ChEMBL_1504608 (CHEMBL3591513)
Ki 1179±n/a nM
Citation Yu, Zvan Veldhoven, JPLouvel, J't Hart, IMRook, MBvan der Heyden, MAHeitman, LHIJzerman, AP Structure-Affinity Relationships (SARs) and Structure-Kinetics Relationships (SKRs) of Kv11.1 Blockers. J Med Chem58:5916-29 (2015) 
 
Potassium voltage-gated channel subfamily H member 2
Name:Potassium voltage-gated channel subfamily H member 2
Type:Multi-pass membrane protein
Mol. Mass.:126672.65
Organism:Homo sapiens (Human)
Description:Q12809
Residue:1159
BDBM50095789
NameBDBM50095789
Synonyms:CHEMBL3590468
TypeSmall organic molecule
Emp. Form.C31H48F3NO3S
Mol. Mass.571.778
SMILES[O-]S(=O)(=O)C(F)(F)F.CCCCCCCCCCC#Cc1cccc(C#CCCCCCCCCCC)[n+]1C