Reaction Details
TargetPotassium voltage-gated channel subfamily H member 2
LigandBDBM50095833
Substrate/Competitorn/a
Meas. Tech.ChEMBL_1504608 (CHEMBL3591513)
Ki 153±n/a nM
Citation Yu, Zvan Veldhoven, JPLouvel, J't Hart, IMRook, MBvan der Heyden, MAHeitman, LHIJzerman, AP Structure-Affinity Relationships (SARs) and Structure-Kinetics Relationships (SKRs) of Kv11.1 Blockers. J Med Chem58:5916-29 (2015) 
 
Potassium voltage-gated channel subfamily H member 2
Name:Potassium voltage-gated channel subfamily H member 2
Type:Multi-pass membrane protein
Mol. Mass.:126672.65
Organism:Homo sapiens (Human)
Description:Q12809
Residue:1159
BDBM50095833
NameBDBM50095833
Synonyms:CHEMBL3590500
TypeSmall organic molecule
Emp. Form.C35H24F3NO5S
Mol. Mass.627.629
SMILES[O-]S(=O)(=O)C(F)(F)F.C[n+]1c(cccc1C#Cc1ccc(cc1)-c1ccc(O)cc1)C#Cc1ccc(cc1)-c1ccc(O)cc1