Reaction Details
TargetPotassium voltage-gated channel subfamily H member 2
LigandBDBM50095767
Substrate/Competitorn/a
Meas. Tech.ChEMBL_1504611 (CHEMBL3591516)
Kd 12±n/a nM
Citation Yu, Zvan Veldhoven, JPLouvel, J't Hart, IMRook, MBvan der Heyden, MAHeitman, LHIJzerman, AP Structure-Affinity Relationships (SARs) and Structure-Kinetics Relationships (SKRs) of Kv11.1 Blockers. J Med Chem58:5916-29 (2015) 
 
Potassium voltage-gated channel subfamily H member 2
Name:Potassium voltage-gated channel subfamily H member 2
Type:Multi-pass membrane protein
Mol. Mass.:126672.65
Organism:Homo sapiens (Human)
Description:Q12809
Residue:1159
BDBM50095767
NameBDBM50095767
Synonyms:CHEMBL3590462
TypeSmall organic molecule
Emp. Form.C19H32F3NO3S
Mol. Mass.411.522
SMILES[O-]S(=O)(=O)C(F)(F)F.CCCCCCc1cccc(CCCCCC)[n+]1C