Reaction Details
TargetPotassium voltage-gated channel subfamily H member 2
LigandBDBM50095769
Substrate/Competitorn/a
Meas. Tech.ChEMBL_1504611 (CHEMBL3591516)
Kd 4.0±n/a nM
Citation Yu, Zvan Veldhoven, JPLouvel, J't Hart, IMRook, MBvan der Heyden, MAHeitman, LHIJzerman, AP Structure-Affinity Relationships (SARs) and Structure-Kinetics Relationships (SKRs) of Kv11.1 Blockers. J Med Chem58:5916-29 (2015) 
 
Potassium voltage-gated channel subfamily H member 2
Name:Potassium voltage-gated channel subfamily H member 2
Type:Multi-pass membrane protein
Mol. Mass.:126672.65
Organism:Homo sapiens (Human)
Description:Q12809
Residue:1159
BDBM50095769
NameBDBM50095769
Synonyms:CHEMBL3590465
TypeSmall organic molecule
Emp. Form.C25H44F3NO3S
Mol. Mass.495.682
SMILES[O-]S(=O)(=O)C(F)(F)F.CCCCCCCCCc1cccc(CCCCCCCCC)[n+]1C