Reaction Details
TargetPotassium voltage-gated channel subfamily H member 2
LigandBDBM50095792
Substrate/Competitorn/a
Meas. Tech.ChEMBL_1504611 (CHEMBL3591516)
Kd 60±n/a nM
Citation Yu, Zvan Veldhoven, JPLouvel, J't Hart, IMRook, MBvan der Heyden, MAHeitman, LHIJzerman, AP Structure-Affinity Relationships (SARs) and Structure-Kinetics Relationships (SKRs) of Kv11.1 Blockers. J Med Chem58:5916-29 (2015) 
 
Potassium voltage-gated channel subfamily H member 2
Name:Potassium voltage-gated channel subfamily H member 2
Type:Multi-pass membrane protein
Mol. Mass.:126672.65
Organism:Homo sapiens (Human)
Description:Q12809
Residue:1159
BDBM50095792
NameBDBM50095792
Synonyms:CHEMBL3590470
TypeSmall organic molecule
Emp. Form.C34H32N
Mol. Mass.454.624
SMILESC[n+]1c(CCc2ccc(cc2)-c2ccccc2)cccc1CCc1ccc(cc1)-c1ccccc1