Reaction Details
TargetPeptidyl-prolyl cis-trans isomerase NIMA-interacting 1
LigandBDBM50095944
Substrate/Competitorn/a
Meas. Tech.ChEMBL_1502595 (CHEMBL3592735)
Kd 3190±n/a nM
Citation Jiang, BPei, D A Selective, Cell-Permeable Nonphosphorylated Bicyclic Peptidyl Inhibitor against Peptidyl-Prolyl Isomerase Pin1. J Med Chem58:6306-12 (2015) 
 
Peptidyl-prolyl cis-trans isomerase NIMA-interacting 1
Name:Peptidyl-prolyl cis-trans isomerase NIMA-interacting 1
Type:PROTEIN
Mol. Mass.:18248.11
Organism:Homo sapiens (Human)
Description:ChEMBL_1502595
Residue:163
BDBM50095944
NameBDBM50095944
Synonyms:CHEMBL3590350
TypeSmall organic molecule
Emp. Form.C111H153N35O25
Mol. Mass.2377.622
SMILES[H][C@@]12CCCN1C(=O)c1cc3cc(c1)C(=O)NC[C@]([H])(NC(=O)[C@@H](C)NC(=O)[C@H](CC(O)=O)NC(=O)[C@H](CCCNC(N)=N)NC(=O)[C@H](Cc1ccc4ccccc4c1)NC(=O)[C@@]1([H])CCCCN1C(=O)[C@@H](CC(O)=O)NC(=O)CN(C)C2=O)C(=O)N[C@@H](Cc1ccccc1)C(=O)N[C@@H](Cc1ccc2ccccc2c1)C(=O)N[C@@H](CCCNC(N)=N)C(=O)N[C@@H](CCCNC(N)=N)C(=O)N[C@@H](CCCNC(N)=N)C(=O)N[C@@H](CCCNC(N)=N)C(=O)N[C@@H](CNC3=O)C(=O)N[C@@H](CCCCN)C(O)=O