Reaction Details
TargetPotassium voltage-gated channel subfamily H member 2
LigandBDBM50095950
Substrate/Competitorn/a
Meas. Tech.ChEMBL_1505208 (CHEMBL3594793)
IC50 28700±n/a nM
Citation Nakajima, YInoue, TNakai, KMukoyoshi, KHamaguchi, HHatanaka, KSasaki, HTanaka, ATakahashi, FKunikawa, SUsuda, HMoritomo, AHigashi, YInami, MShirakami, S Synthesis and evaluation of novel 1H-pyrrolo[2,3-b]pyridine-5-carboxamide derivatives as potent and orally efficacious immunomodulators targeting JAK3. Bioorg Med Chem23:4871-83 (2015) 
 
Potassium voltage-gated channel subfamily H member 2
Name:Potassium voltage-gated channel subfamily H member 2
Type:Multi-pass membrane protein
Mol. Mass.:126672.65
Organism:Homo sapiens (Human)
Description:Q12809
Residue:1159
BDBM50095950
NameBDBM50095950
Synonyms:CHEMBL3593779
TypeSmall organic molecule
Emp. Form.C20H21N7O
Mol. Mass.375.427
SMILESC[C@H]1CN(CC[C@H]1Nc1c(cnc2[nH]ccc12)C(N)=O)c1ccc(cn1)C#N