Reaction Details
TargetTyrosine-protein kinase JAK2
LigandBDBM50095963
Substrate/Competitorn/a
Meas. Tech.ChEMBL_1505205 (CHEMBL3594790)
IC50 430±n/a nM
Citation Nakajima, YInoue, TNakai, KMukoyoshi, KHamaguchi, HHatanaka, KSasaki, HTanaka, ATakahashi, FKunikawa, SUsuda, HMoritomo, AHigashi, YInami, MShirakami, S Synthesis and evaluation of novel 1H-pyrrolo[2,3-b]pyridine-5-carboxamide derivatives as potent and orally efficacious immunomodulators targeting JAK3. Bioorg Med Chem23:4871-83 (2015) 
 
Tyrosine-protein kinase JAK2
Name:Tyrosine-protein kinase JAK2
Type:Protein
Mol. Mass.:130684.68
Organism:Homo sapiens (Human)
Description:O60674
Residue:1132
BDBM50095963
NameBDBM50095963
Synonyms:CHEMBL3593766
TypeSmall organic molecule
Emp. Form.C20H23N5O
Mol. Mass.349.4295
SMILESNC(=O)c1cnc2[nH]ccc2c1N[C@@H]1CCCN(Cc2ccccc2)C1