Reaction Details
TargetTyrosine-protein kinase JAK3
LigandBDBM50095964
Substrate/Competitorn/a
Meas. Tech.ChEMBL_1505207 (CHEMBL3594792)
IC50 23±n/a nM
Citation Nakajima, YInoue, TNakai, KMukoyoshi, KHamaguchi, HHatanaka, KSasaki, HTanaka, ATakahashi, FKunikawa, SUsuda, HMoritomo, AHigashi, YInami, MShirakami, S Synthesis and evaluation of novel 1H-pyrrolo[2,3-b]pyridine-5-carboxamide derivatives as potent and orally efficacious immunomodulators targeting JAK3. Bioorg Med Chem23:4871-83 (2015) 
 
Tyrosine-protein kinase JAK3
Name:Tyrosine-protein kinase JAK3
Type:Protein
Mol. Mass.:125111.08
Organism:Homo sapiens (Human)
Description:P52333
Residue:1124
BDBM50095964
NameBDBM50095964
Synonyms:CHEMBL3593765
TypeSmall organic molecule
Emp. Form.C20H23N5O
Mol. Mass.349.4295
SMILESNC(=O)c1cnc2[nH]ccc2c1NC1CCN(Cc2ccccc2)CC1