Reaction Details
TargetReceptor tyrosine-protein kinase erbB-2
LigandBDBM50095952
Substrate/Competitorn/a
Meas. Tech.ChEMBL_1505247 (CHEMBL3594872)
IC50>1000±n/a nM
Citation Nakajima, YInoue, TNakai, KMukoyoshi, KHamaguchi, HHatanaka, KSasaki, HTanaka, ATakahashi, FKunikawa, SUsuda, HMoritomo, AHigashi, YInami, MShirakami, S Synthesis and evaluation of novel 1H-pyrrolo[2,3-b]pyridine-5-carboxamide derivatives as potent and orally efficacious immunomodulators targeting JAK3. Bioorg Med Chem23:4871-83 (2015) 
 
Receptor tyrosine-protein kinase erbB-2
Name:Receptor tyrosine-protein kinase erbB-2
Type:n/a
Mol. Mass.:137894.47
Organism:Homo sapiens (Human)
Description:P04626
Residue:1255
BDBM50095952
NameBDBM50095952
Synonyms:CHEMBL3593777
TypeSmall organic molecule
Emp. Form.C19H18FN7O
Mol. Mass.379.3909
SMILESNC(=O)c1cnc2[nH]ccc2c1N[C@@H]1CCN(C[C@@H]1F)c1ccc(cn1)C#N