Reaction Details
TargetAmyloid-beta precursor protein
LigandBDBM50095987
Substrate/Competitorn/a
Meas. Tech.ChEMBL_1505358 (CHEMBL3595184)
IC50 26000±n/a nM
Citation Chegaev, KFederico, AMarini, ERolando, BFruttero, RMorbin, MRossi, GFugnanesi, VBastone, ASalmona, MBadiola, NBGasparini, LCocco, SRipoli, CGrassi, CGasco, A NO-donor thiacarbocyanines as multifunctional agents for Alzheimer's disease. Bioorg Med Chem23:4688-98 (2015) 
 
Amyloid-beta precursor protein
Name:Amyloid-beta precursor protein
Type:Single-pass type I membrane protein
Mol. Mass.:86890.41
Organism:Homo sapiens (Human)
Description:P05067
Residue:770
BDBM50095987
NameBDBM50095987
Synonyms:CHEMBL3593280
TypeSmall organic molecule
Emp. Form.C25H24IN5O4S2
Mol. Mass.649.524
SMILES[I-].CCN1\C(Sc2ccc(OCc3no[n+]([O-])c3C(N)=O)cc12)=C\C=C\c1sc2ccccc2[n+]1CC