Reaction Details
TargetPutative P2Y purinoceptor 10
LigandBDBM50096427
Substrate/Competitorn/a
Meas. Tech.ChEMBL_1495909 (CHEMBL3579720)
EC50 520±n/a nM
Citation Ikubo, MInoue, ANakamura, SJung, SSayama, MOtani, YUwamizu, ASuzuki, KKishi, TShuto, AIshiguro, JOkudaira, MKano, KMakide, KAoki, JOhwada, T Structure-activity relationships of lysophosphatidylserine analogs as agonists of G-protein-coupled receptors GPR34, P2Y10, and GPR174. J Med Chem58:4204-19 (2015) 
 
Putative P2Y purinoceptor 10
Name:Putative P2Y purinoceptor 10
Type:PROTEIN
Mol. Mass.:38793.96
Organism:Homo sapiens (Human)
Description:ChEMBL_109762
Residue:339
BDBM50096427
NameBDBM50096427
Synonyms:CHEMBL3577152
TypeSmall organic molecule
Emp. Form.C18H36NO8P
Mol. Mass.425.4541
SMILESCCCCCCCCCCCC(=O)OCCCOP(O)(=O)OC[C@H](N)C(O)=O