Reaction Details
TargetDipeptidyl peptidase 4
LigandBDBM50096868
Substrate/Competitorn/a
Meas. Tech.ChEMBL_1499202 (CHEMBL3582591)
IC50 3.8±n/a nM
Citation Jiang, TZhou, YChen, ZSun, PZhu, JZhang, QWang, ZShao, QJiang, XLi, BChen, KJiang, HWang, HZhu, WShen, J Design, Synthesis, and Pharmacological Evaluation of Fusedß-Homophenylalanine Derivatives as Potent DPP-4 Inhibitors. ACS Med Chem Lett6:602-6 (2015) 
 
Dipeptidyl peptidase 4
Name:Dipeptidyl peptidase 4
Type:Enzyme
Mol. Mass.:88271.01
Organism:Homo sapiens (Human)
Description:P27487
Residue:766
BDBM50096868
NameBDBM50096868
Synonyms:CHEMBL3580779
TypeSmall organic molecule
Emp. Form.C21H20F3N3O2
Mol. Mass.403.3976
SMILES[H][C@@]1(CCc2cc(F)c(F)cc12)[C@@H](N)CC(=O)N1Cc2ccc(F)cc2NC(=O)C1