Reaction Details
TargetDipeptidyl peptidase 4
LigandBDBM50096897
Substrate/Competitorn/a
Meas. Tech.ChEMBL_1499202 (CHEMBL3582591)
IC50 2.9±n/a nM
Citation Jiang, TZhou, YChen, ZSun, PZhu, JZhang, QWang, ZShao, QJiang, XLi, BChen, KJiang, HWang, HZhu, WShen, J Design, Synthesis, and Pharmacological Evaluation of Fusedß-Homophenylalanine Derivatives as Potent DPP-4 Inhibitors. ACS Med Chem Lett6:602-6 (2015) 
 
Dipeptidyl peptidase 4
Name:Dipeptidyl peptidase 4
Type:Enzyme
Mol. Mass.:88271.01
Organism:Homo sapiens (Human)
Description:P27487
Residue:766
BDBM50096897
NameBDBM50096897
Synonyms:CHEMBL3580790
TypeSmall organic molecule
Emp. Form.C23H25F2N3O2
Mol. Mass.413.4603
SMILES[H][C@@]1(CCc2cc(F)c(F)cc12)[C@@H](N)CC(=O)N1Cc2ccccc2N(CC)C(=O)C1