Reaction Details
TargetAdenosylhomocysteinase
LigandBDBM50006222
Substrate/Competitorn/a
Meas. Tech.ChEMBL_1499249 (CHEMBL3582891)
IC50 470±n/a nM
Citation Chandra, GMoon, YWLee, YJang, JYSong, JNayak, AOh, KMulamoottil, VASahu, PKKim, GChang, TSNoh, MLee, SKChoi, SJeong, LS Structure-Activity Relationships of Neplanocin A Analogues as S-Adenosylhomocysteine Hydrolase Inhibitors and Their Antiviral and Antitumor Activities. J Med Chem58:5108-20 (2015) 
 
Adenosylhomocysteinase
Name:Adenosylhomocysteinase
Type:PROTEIN
Mol. Mass.:47714.06
Organism:Homo sapiens (Human)
Description:ChEMBL_1507791
Residue:432
BDBM50006222
NameBDBM50006222
Synonyms:(1S,2R,5R)-5-(6-Amino-purin-9-yl)-3-hydroxymethyl-cyclopent-3-ene-1,2-diol 5-(6-Amino-purin-9-yl)-3-hydroxymethyl-cyclopent-3-ene-1,2-diol 5-(6-Amino-purin-9-yl)-3-hydroxymethyl-cyclopent-3-ene-1,2-diol (Neplonocin A) 5-(6-Amino-purin-9-yl)-3-hydroxymethyl-cyclopent-3-ene-1,2-diol(NPA) CHEMBL8771 | Neplanocin A
TypeSmall organic molecule
Emp. Form.C11H13N5O3
Mol. Mass.263.2526
SMILESNc1ncnc2n(cnc12)[C@@H]1C=C(CO)[C@@H](O)[C@H]1O