Reaction Details
TargetSerine/threonine-protein kinase PAK 1
LigandBDBM50097126
Substrate/Competitorn/a
Meas. Tech.ChEMBL_1499557 (CHEMBL3584415)
Ki 179±n/a nM
Citation Crawford, JJLee, WAliagas, IMathieu, SHoeflich, KPZhou, WWang, WRouge, LMurray, LLa, HLiu, NFan, PWCheong, JHeise, CERamaswamy, SMintzer, RLiu, YChao, QRudolph, J Structure-Guided Design of Group I Selective p21-Activated Kinase Inhibitors. J Med Chem58:5121-36 (2015) 
 
Serine/threonine-protein kinase PAK 1
Name:Serine/threonine-protein kinase PAK 1
Type:n/a
Mol. Mass.:60640.15
Organism:Homo sapiens (Human)
Description:Q13153
Residue:545
BDBM50097126
NameBDBM50097126
Synonyms:CHEMBL3580950
TypeSmall organic molecule
Emp. Form.C15H19N7S
Mol. Mass.329.423
SMILESCc1cc(Nc2nc(nc3ccsc23)N2CCC(N)CC2)n[nH]1