Reaction Details
TargetSerine/threonine-protein kinase PAK 4
LigandBDBM50097136
Substrate/Competitorn/a
Meas. Tech.ChEMBL_1499558 (CHEMBL3584416)
Ki 1109±n/a nM
Citation Crawford, JJLee, WAliagas, IMathieu, SHoeflich, KPZhou, WWang, WRouge, LMurray, LLa, HLiu, NFan, PWCheong, JHeise, CERamaswamy, SMintzer, RLiu, YChao, QRudolph, J Structure-Guided Design of Group I Selective p21-Activated Kinase Inhibitors. J Med Chem58:5121-36 (2015) 
 
Serine/threonine-protein kinase PAK 4
Name:Serine/threonine-protein kinase PAK 4
Type:Protein
Mol. Mass.:64098.01
Organism:Homo sapiens (Human)
Description:O96013
Residue:591
BDBM50097136
NameBDBM50097136
Synonyms:CHEMBL3580973
TypeSmall organic molecule
Emp. Form.C18H17FN8
Mol. Mass.364.3796
SMILESFc1c(CNc2nccc(Nc3cc([nH]n3)C3CC3)n2)ccc2[nH]cnc12