Reaction Details
TargetSerine/threonine-protein kinase PAK 4
LigandBDBM50097141
Substrate/Competitorn/a
Meas. Tech.ChEMBL_1499558 (CHEMBL3584416)
Ki 907±n/a nM
Citation Crawford, JJLee, WAliagas, IMathieu, SHoeflich, KPZhou, WWang, WRouge, LMurray, LLa, HLiu, NFan, PWCheong, JHeise, CERamaswamy, SMintzer, RLiu, YChao, QRudolph, J Structure-Guided Design of Group I Selective p21-Activated Kinase Inhibitors. J Med Chem58:5121-36 (2015) 
 
Serine/threonine-protein kinase PAK 4
Name:Serine/threonine-protein kinase PAK 4
Type:Protein
Mol. Mass.:64098.01
Organism:Homo sapiens (Human)
Description:O96013
Residue:591
BDBM50097141
NameBDBM50097141
Synonyms:CHEMBL3580966
TypeSmall organic molecule
Emp. Form.C18H22N8
Mol. Mass.350.4209
SMILESCN(C)c1ccc(CNc2nccc(Nc3cc([nH]n3)C3CC3)n2)cn1