Reaction Details
TargetSerine/threonine-protein kinase PAK 4
LigandBDBM50097147
Substrate/Competitorn/a
Meas. Tech.ChEMBL_1499558 (CHEMBL3584416)
Ki 1820±n/a nM
Citation Crawford, JJLee, WAliagas, IMathieu, SHoeflich, KPZhou, WWang, WRouge, LMurray, LLa, HLiu, NFan, PWCheong, JHeise, CERamaswamy, SMintzer, RLiu, YChao, QRudolph, J Structure-Guided Design of Group I Selective p21-Activated Kinase Inhibitors. J Med Chem58:5121-36 (2015) 
 
Serine/threonine-protein kinase PAK 4
Name:Serine/threonine-protein kinase PAK 4
Type:Protein
Mol. Mass.:64098.01
Organism:Homo sapiens (Human)
Description:O96013
Residue:591
BDBM50097147
NameBDBM50097147
Synonyms:CHEMBL3580959
TypeSmall organic molecule
Emp. Form.C16H22N6
Mol. Mass.298.3861
SMILESNC1CCN(CC1)c1cc(Nc2cc([nH]n2)C2CC2)ccn1